BDBM223055 US9321721, Example 3
SMILES COc1ccc(cc1)C(=C\C(N)=O)\c1ccc(NC(=O)Nc2cc(ccc2F)C(F)(F)F)cc1
InChI Key InChIKey=ZPWDJGRWUOBJPM-CPNJWEJPSA-N
Data  1 IC50
  Tab Delimited (TSV)   2D SDfile   Computed 3D by Vconf -m prep SDfile
Find this compound or compounds like it in BindingDB:
Activity Spreadsheet -- Enzyme Inhibition Constant Data from BindingDB
Found 1 hit for monomerid = 223055
TargetVascular endothelial growth factor receptor 2(Homo sapiens (Human))
Allergan
US Patent
LigandPNGBDBM223055(US9321721, Example 3)
Affinity DataIC50:  457nMpH: 7.4Assay Description:Biochemical KDR kinase assays were performed in 96 well microtiter plates that were coated overnight with 75 μg/well of poly-Glu-Tyr (4:1) in 10 m...
Ligand InfoPC cidPC sid
In DepthDetails US Patent